Debian PTS – Tracker – Changelog – Bugs – packages.d.o – buildd.d.o – Source
Architecture | Version | Status | For | Buildd | State | Section | Logs | Actions |
---|---|---|---|---|---|---|---|---|
![]() | 6.3.5-1 | Build-Attempted | 18d 9h 28m | mb-lxc-01 | out-of-date | misc | old | all (1) | giveback |
/<<PKGBUILDDIR>>/src/AbstractSession.cpp:144:31: error: 'class PipeWireEncodedStream' has no member named 'start' 144 | d->encodedStream->start(); | ^~~~~ At global scope: cc1plus: note: unrecognized command-line option '-Wno-c99-extensions' may have been intended to silence earlier diagnostics cc1plus: note: unrecognized command-line option '-Wno-gnu-statement-expression-from-macro-expansion' may have been intended to silence earlier diagnostics make[3]: *** [src/CMakeFiles/KRdp.dir/build.make:298: src/CMakeFiles/KRdp.dir/AbstractSession.cpp.o] Error 1 make[3]: *** Waiting for unfinished jobs.... make[3]: Leaving directory '/<<PKGBUILDDIR>>/obj-arm-linux-gnueabihf' make[2]: *** [CMakeFiles/Makefile2:750: src/CMakeFiles/KRdp.dir/all] Error 2 make[2]: Leaving directory '/<<PKGBUILDDIR>>/obj-arm-linux-gnueabihf' make[1]: *** [Makefile:149: all] Error 2 make[1]: Leaving directory '/<<PKGBUILDDIR>>/obj-arm-linux-gnueabihf' dh_auto_build: error: cd obj-arm-linux-gnueabihf && make -j4 "INSTALL=install --strip-program=true" VERBOSE=1 returned exit code 2 make: *** [debian/rules:6: binary-arch] Error 25