Raspbian Package Auto-Building

Buildd status for tinyarray (forky-staging)

Debian PTS – Tracker – Changelog – Bugs – packages.d.o – buildd.d.o – Source

Package(s): Suite:
Compact mode Co-maintainers

ArchitectureVersionStatusForBuilddStateSectionLogsActions
Buildd exposure stats armhf  ↓1.2.5-1Build-Attempted247d 23h 31mmb-lxc-02uncompiledmiscold | all (1)giveback

Tail of log for tinyarray on armhf:

  File "/usr/lib/python3/dist-packages/pluggy/_manager.py", line 120 in _hookexec
  File "/usr/lib/python3/dist-packages/pluggy/_hooks.py", line 512 in __call__
  File "/usr/lib/python3/dist-packages/_pytest/config/__init__.py", line 199 in main
  File "/usr/lib/python3/dist-packages/_pytest/config/__init__.py", line 223 in console_main
  File "/usr/lib/python3/dist-packages/pytest/__main__.py", line 9 in <module>
  File "<frozen runpy>", line 88 in _run_code
  File "<frozen runpy>", line 198 in _run_module_as_main

Extension modules: tinyarray, numpy._core._multiarray_umath, numpy.linalg._umath_linalg (total: 3)
Aborted
E: pybuild pybuild:483: test: plugin distutils failed with: exit code=134: cd /<<PKGBUILDDIR>>/.pybuild/cpython3_3.13_tinyarray/build; python3.13 -m pytest ../../../test_tinyarray.py
dh_auto_test: error: pybuild --test --test-pytest -i python{version} -p 3.13 --test-pytest --test-args=../../../test_tinyarray.py returned exit code 13
make[1]: *** [debian/rules:11: override_dh_auto_test] Error 25
make[1]: Leaving directory '/<<PKGBUILDDIR>>'
make: *** [debian/rules:7: binary-arch] Error 2