Debian PTS – Tracker – Changelog – Bugs – packages.d.o – buildd.d.o – Source
| Architecture | Version | Status | For | Buildd | State | Section | Logs | Actions |
|---|---|---|---|---|---|---|---|---|
armhf ↓ | 2.1.5-4 | Build-Attempted | 974d 20h 23m | testwandboard | uncompiled | misc | old | all (20) | giveback |
4979 | #define yydestruct(m, t, v) ruby_parser_yydestruct(m, t, v, parser)
|
parse.c:10853:63: error: macro "yydestruct" passed 4 arguments, but takes just 3
10853 | this YYABORT or YYACCEPT. */
| ^
parse.c:4979: note: macro "yydestruct" defined here
4979 | #define yydestruct(m, t, v) ruby_parser_yydestruct(m, t, v, parser)
|
make[2]: *** [Makefile:334: parse.o] Error 1
make[2]: *** Waiting for unfinished jobs....
make[2]: Leaving directory '/<<PKGBUILDDIR>>'
dh_auto_build: error: make -j4 main V=1 returned exit code 2
make[1]: *** [debian/rules:67: override_dh_auto_build-arch] Error 25
make[1]: Leaving directory '/<<PKGBUILDDIR>>'
make: *** [debian/rules:49: build-arch] Error 2