Raspbian Package Auto-Building

Buildd status for process-cpp (forky-staging)

Debian PTS – Tracker – Changelog – Bugs – packages.d.o – buildd.d.o – Source

Package(s): Suite:
Compact mode Co-maintainers

ArchitectureVersionStatusForBuilddStateSectionLogsActions
Buildd exposure stats armhf  ↓3.1.0-2Build-Attempted175d 12h 4mtest2023out-of-datemiscold | all (1)giveback

Tail of log for process-cpp on armhf:

1: [==========] 29 tests from 6 test suites ran. (538 ms total)
1: [  PASSED  ] 29 tests.
5/5 Test #1: posix_process_test ...............   Passed    0.55 sec

80% tests passed, 1 tests failed out of 5

Total Test time (real) =   0.55 sec

The following tests FAILED:
	  4 - cross_process_sync_test (Failed)
Errors while running CTest
make[1]: *** [Makefile:74: test] Error 8
make[1]: Leaving directory '/<<PKGBUILDDIR>>/obj-arm-linux-gnueabihf'
dh_auto_test: error: cd obj-arm-linux-gnueabihf && make -j4 test ARGS\+=--verbose ARGS\+=-j4 returned exit code 2
make: *** [debian/rules:8: binary-arch] Error 25