Raspbian Package Auto-Building

Buildd status for nautilus (trixie-staging)

Debian PTSTrackerChangelogBugspackages.d.obuildd.d.oSource

Package(s): Suite:
Compact mode Co-maintainers

ArchitectureVersionStatusForBuilddStateSectionLogsActions
Buildd exposure stats armhf  48.3-2Build-Attempted40d 1h 23mbm-wb-04out-of-dategnomeold | all (1)giveback

Tail of log for nautilus on armhf:

Summary of Failures:

18/20 nautilus:displayless+tracker / test-nautilus-search-engine-tracker    FAIL            26.97s   (exit status 134 or signal 6 SIGABRT)

Ok:                 19  
Expected Fail:      0   
Fail:               1   
Unexpected Pass:    0   
Skipped:            0   
Timeout:            0   
dh_auto_test: error: cd obj-arm-linux-gnueabihf && DEB_PYTHON_INSTALL_LAYOUT=deb LC_ALL=C.UTF-8 MESON_TESTTHREADS=4 meson test --verbose returned exit code 1
make[1]: *** [debian/rules:42: override_dh_auto_test] Error 25
make[1]: Leaving directory '/<<PKGBUILDDIR>>'
make: *** [debian/rules:30: binary-arch] Error 2