Debian PTS – Tracker – Changelog – Bugs – packages.d.o – buildd.d.o – Source
| Architecture | Version | Status | For | Buildd | State | Section | Logs | Actions |
|---|---|---|---|---|---|---|---|---|
armhf ↓ | 3.6.1-4+deb12u3 | Build-Attempted | 455d 22h 19m | test2023 | out-of-date | misc | old | all (1) | giveback |
asserts 850903 850903 850902 1 n/a
Elapsed time = 0.452 seconds
FAILED
1. ./cunit/command.testc:21 - CU_ASSERT_EQUAL_FATAL(r=-1904809469,0=0)
Test: popen_r ...make[4]: *** [Makefile:8541: check-local] Error 141
make[4]: Leaving directory '/<<PKGBUILDDIR>>'
make[3]: *** [Makefile:7419: check-am] Error 2
make[3]: Leaving directory '/<<PKGBUILDDIR>>'
make[2]: *** [Makefile:7119: check-recursive] Error 1
make[2]: Leaving directory '/<<PKGBUILDDIR>>'
make[1]: *** [Makefile:7421: check] Error 2
make[1]: Leaving directory '/<<PKGBUILDDIR>>'
dh_auto_test: error: make -j4 check "TESTSUITEFLAGS=-j4 --verbose" VERBOSE=1 returned exit code 2
make: *** [debian/rules:57: binary-arch] Error 25