Raspbian Package Auto-Building

Buildd status for atlas (trixie-staging)

Debian PTSTrackerChangelogBugspackages.d.obuildd.d.oSource

Package(s): Suite:
Compact mode Co-maintainers

ArchitectureVersionStatusForBuilddStateSectionLogsActions
Buildd exposure stats armhf  3.10.3-13+rpi1+b1Build-Attempted36d 14h 41mtestbuilddout-of-datedevelold | all (1)giveback

BinNMU changelog for atlas on armhf:

rebuild due to debcheck failure

Tail of log for atlas on armhf:

make[1]: Leaving directory '/<<PKGBUILDDIR>>'
   debian/rules override_dh_auto_build-arch
make[1]: Entering directory '/<<PKGBUILDDIR>>'
make -C build
make[2]: Entering directory '/<<PKGBUILDDIR>>/build'
make -f Make.top build
make[3]: Entering directory '/<<PKGBUILDDIR>>/build'
Make.top:1: Make.inc: No such file or directory
make[3]: *** No rule to make target 'Make.inc'.  Stop.
make[3]: Leaving directory '/<<PKGBUILDDIR>>/build'
make[2]: *** [Makefile:537: build] Error 2
make[2]: Leaving directory '/<<PKGBUILDDIR>>/build'
make[1]: *** [debian/rules:122: override_dh_auto_build-arch] Error 2
make[1]: Leaving directory '/<<PKGBUILDDIR>>'
make: *** [debian/rules:109: binary-arch] Error 2